Reaction Details
TargetCytochrome b-245 heavy chain
LigandBDBM244081
Substrate/Competitorn/a
Meas. Tech.Activity Assay
IC50 300000000±n/a nM
Citation Ganesh, TSun, ASmith, SMLambeth, JD Piperazine derivatives, compositions, and uses related thereto US Patent US9428478 Publication Date 8/30/2016
 
Cytochrome b-245 heavy chain
Name:Cytochrome b-245 heavy chain
Type:Enzyme
Mol. Mass.:65355.82
Organism:Homo sapiens (Human)
Description:P04839
Residue:570
BDBM244081
NameBDBM244081
Synonyms:US9428478, TG6-222
TypeSmall organic molecule
Emp. Form.C22H23N3O4
Mol. Mass.393.4357
SMILESCOC(=O)c1ccc2[nH]c(cc2c1)C(=O)N1CCN(CC1)c1ccc(OC)cc1