Reaction Details
TargetProthrombin
LigandBDBM294039
Substrate/Competitorn/a
Meas. Tech.Prothrombin Assay
pH7.4±n/a
Ki 0.470±n/a nM
Commentsextracted
Citation Chen, SDing, ZGong, GYan, XHuang, WGuo, FDuan, BGao, RZhou, PLu, XDong, G Preparation method for benzoxazoleoxazine ketone compound and intermediate and crystal form thereof US Patent US10106557 Publication Date 10/23/2018
 
Prothrombin
Name:Prothrombin
Type:Protein
Mol. Mass.:70029.57
Organism:Homo sapiens (Human)
Description:P00734
Residue:622
BDBM294039
NameBDBM294039
Synonyms:Process 1 | US10106557, Compound 1
TypeSmall organic molecule
Emp. Form.C18H18N2O5
Mol. Mass.342.3459
SMILESOc1cc(ccc1NC(=O)OCc1ccccc1)N1CCOCC1=O