Reaction Details
TargetProthrombin
LigandBDBM294041
Substrate/Competitorn/a
Meas. Tech.Prothrombin Assay
pH7.4±n/a
Ki 4.41±n/a nM
Commentsextracted
Citation Chen, SDing, ZGong, GYan, XHuang, WGuo, FDuan, BGao, RZhou, PLu, XDong, G Preparation method for benzoxazoleoxazine ketone compound and intermediate and crystal form thereof US Patent US10106557 Publication Date 10/23/2018
 
Prothrombin
Name:Prothrombin
Type:Protein
Mol. Mass.:70029.57
Organism:Homo sapiens (Human)
Description:P00734
Residue:622
BDBM294041
NameBDBM294041
Synonyms:US10106557, Compound 7
TypeSmall organic molecule
Emp. Form.C20H19ClN4O5S
Mol. Mass.462.907
SMILESClc1ccc(s1)C(=O)NC[C@@H]1OC(=O)N2[C@H]1COc1cc(ccc21)N1CCCNC1=O