Reaction Details
TargetCoagulation factor X
LigandBDBM294043
Substrate/Competitorn/a
Meas. Tech.Human Coagulation Factor Xa Assay
pH8.3±n/a
Ki 9.71±n/a nM
Commentsextracted
Citation Chen, SDing, ZGong, GYan, XHuang, WGuo, FDuan, BGao, RZhou, PLu, XDong, G Preparation method for benzoxazoleoxazine ketone compound and intermediate and crystal form thereof US Patent US10106557 Publication Date 10/23/2018
 
Coagulation factor X
Name:Coagulation factor X
Type:Enzyme
Mol. Mass.:54726.60
Organism:Homo sapiens (Human)
Description:n/a
Residue:488
BDBM294043
NameBDBM294043
Synonyms:US10106557, Compound 30
TypeSmall organic molecule
Emp. Form.C22H24ClN3O5S
Mol. Mass.477.961
SMILESCOC[C@H]1CCCN1c1ccc2N3[C@@H](COc2c1)[C@H](CNC(=O)c1ccc(Cl)s1)OC3=O