Reaction Details
TargetTransient receptor potential M8 protein
LigandBDBM248838
Substrate/Competitorn/a
Meas. Tech.Functional Assay
Temperature310.15±n/a K
IC50 0.7±n/a nM
Commentsextracted
Citation Branum, STColburn, RWDax, SLFlores, CMJetter, MCLiu, YLudovici, DMacielag, MJMatthews, JMMcNally, JJAndraka, LMRussell, RKQin, NTeleha, CWells, KMYouells, SCYoungman, MA Sulfonamides as TRPM8 modulators US Patent US9434711 Publication Date 9/6/2016
 
Transient receptor potential M8 protein
Name:Transient receptor potential M8 protein
Type:Enzyme
Mol. Mass.:127589.43
Organism:Canis lupus familiaris (Dog)
Description:Q1A7N1
Residue:1104
BDBM248838
NameBDBM248838
Synonyms:US9434711, 808
TypeSmall organic molecule
Emp. Form.C24H17F3N4O5S2
Mol. Mass.562.541
SMILESCc1c(sc2ccccc12)N(Cc1ccc(OC(F)(F)F)cc1)S(=O)(=O)c1ccc(nc1)-c1noc(=O)[nH]1