Reaction Details
TargetRho-associated protein kinase 1
LigandBDBM252112
Substrate/Competitorn/a
Meas. Tech.In Vitro Assay
pH7.5±n/a
IC50 2.22±n/a nM
Commentsextracted
Citation Quan, MLHu, ZWang, CGlunz, PW Phenylpyrazole derivatives as potent ROCK1 and ROCK2 inhibitors US Patent US9458110 Publication Date 10/4/2016
 
Rho-associated protein kinase 1
Name:Rho-associated protein kinase 1
Type:Serine/threonine-protein kinase
Mol. Mass.:158156.77
Organism:Homo sapiens (Human)
Description:Q13464
Residue:1354
BDBM252112
NameBDBM252112
Synonyms:US9458110, 183
TypeSmall organic molecule
Emp. Form.C18H16FN3O2
Mol. Mass.325.3369
SMILESC[C@@H](NC(=O)c1ccc(-c2cn[nH]c2)c(O)c1)c1ccc(F)cc1