Reaction Details
TargetP2X purinoceptor 7
LigandBDBM254271
Substrate/Competitorn/a
Meas. Tech.Radioligand Binding Assay
Ki 2.5±n/a nM
Citation Alcazar Vaca, MJAndres Gil, JIChrovian, CCCoate, HRDe Angelis, MDvorak, CAGelin, CFLetavic, MASavall, BMSoyode-Johnson, AStenne, BMSwanson, DM P2X7 modulators US Patent US9464084 Publication Date 10/11/2016
 
P2X purinoceptor 7
Name:P2X purinoceptor 7
Type:Protein
Mol. Mass.:68602.85
Organism:Homo sapiens (Human)
Description:Q99572
Residue:595
BDBM254271
NameBDBM254271
Synonyms:US10112937, Example 166 US10703749, Example 166 | US9464084, 166
TypeSmall organic molecule
Emp. Form.C18H14Cl2FN5O
Mol. Mass.406.241
SMILESC[C@H]1Cc2c(CN1C(=O)c1cccc(Cl)c1Cl)nnn2-c1ncccc1F