Reaction Details
TargetP2X purinoceptor 7
LigandBDBM254305
Substrate/Competitorn/a
Meas. Tech.Radioligand Binding Assay
Ki 2.5±n/a nM
Citation Alcazar Vaca, MJAndres Gil, JIChrovian, CCCoate, HRDe Angelis, MDvorak, CAGelin, CFLetavic, MASavall, BMSoyode-Johnson, AStenne, BMSwanson, DM P2X7 modulators US Patent US9464084 Publication Date 10/11/2016
 
P2X purinoceptor 7
Name:P2X purinoceptor 7
Type:Protein
Mol. Mass.:68403.50
Organism:Rattus norvegicus (Rat)
Description:Q64663
Residue:595
BDBM254305
NameBDBM254305
Synonyms:US10112937, Example 202 US10703749, Example 202 | US9464084, 202
TypeSmall organic molecule
Emp. Form.C18H13ClF4N6O
Mol. Mass.440.782
SMILESC[C@H]1Cc2c(CN1C(=O)c1cccc(c1Cl)C(F)(F)F)nnn2-c1ncc(F)cn1