Reaction Details
TargetProthrombin
LigandBDBM254892
Substrate/CompetitorBDBM254912
Meas. Tech.Inhibition Assay
pH7.4±n/a
Temperature295.15±n/a K
IC50 0.72±n/a nM
Commentsextracted
Citation Allerheiligen, SBuchmüller, AEngel, KGerdes, CGericke, KMGerisch, MHeitmeier, SHillisch, AKinzel, TLienau, PRiedl, BRöhrig, SSchmidt, MVStrassburger, JTersteegen, A Substituted benzoxazoles US Patent US9493472 Publication Date 11/15/2016
 
Prothrombin
Name:Prothrombin
Type:Protein
Mol. Mass.:70029.57
Organism:Homo sapiens (Human)
Description:P00734
Residue:622
BDBM254892
BDBM254912
NameBDBM254892
Synonyms:US9493472, 15
TypeSmall organic molecule
Emp. Form.C24H27ClFN3O5
Mol. Mass.491.94
SMILESCOc1cc(cc2nc(N[C@@H](CF)c3cccc(Cl)c3)oc12)C(=O)N1CC(C)OC[C@@H]1CCO