Reaction Details
TargetProthrombin
LigandBDBM254910
Substrate/CompetitorBDBM254912
Meas. Tech.Inhibition Assay
pH7.4±n/a
Temperature295.15±n/a K
IC50 0.70±n/a nM
Commentsextracted
Citation Allerheiligen, SBuchmüller, AEngel, KGerdes, CGericke, KMGerisch, MHeitmeier, SHillisch, AKinzel, TLienau, PRiedl, BRöhrig, SSchmidt, MVStrassburger, JTersteegen, A Substituted benzoxazoles US Patent US9493472 Publication Date 11/15/2016
 
Prothrombin
Name:Prothrombin
Type:Protein
Mol. Mass.:70029.57
Organism:Homo sapiens (Human)
Description:P00734
Residue:622
BDBM254910
BDBM254912
NameBDBM254910
Synonyms:US9493472, 32
TypeSmall organic molecule
Emp. Form.C24H24ClFN4O4
Mol. Mass.486.923
SMILESCOc1cc(cc2nc(NC(CF)c3cccc(Cl)c3)oc12)C(=O)N1CC2(CC2)NC(=O)C1C