Reaction Details
TargetIsoform 2 of Nuclear receptor ROR-gamma (RORgT)
LigandBDBM256375
Substrate/Competitorn/a
Meas. Tech.TR-FRET Assay
pH7±n/a
Temperature277.15±n/a K
IC50 3±n/a nM
Commentsextracted
Citation Barr, KJMaclean, JKZhang, HBeresis, RTZhang, DAndresen, BMAnthony, NJLapointe, BTSciammetta, N 3-cyclohexenyl and cyclohexyl substituted indole and indazole compounds as RORgammaT inhibitors and uses thereof US Patent US9487490 Publication Date 11/8/2016
 
Isoform 2 of Nuclear receptor ROR-gamma (RORgT)
Name:Isoform 2 of Nuclear receptor ROR-gamma (RORgT)
Type:Protein
Mol. Mass.:55831.73
Organism:Homo sapiens (Human)
Description:P51449-2
Residue:497
BDBM256375
NameBDBM256375
Synonyms:US9487490, 4W
TypeSmall organic molecule
Emp. Form.C26H21ClF3N3O5
Mol. Mass.547.91
SMILESOC1CN(C1)C(=O)c1ccc2c(nn(C(=O)c3c(Cl)cccc3C(F)(F)F)c2c1)C1=CCC(CC1)C(O)=O