Reaction Details
TargetIsoform 2 of Nuclear receptor ROR-gamma (RORgT)
LigandBDBM256392
Substrate/Competitorn/a
Meas. Tech.TR-FRET Assay
pH7±n/a
Temperature277.15±n/a K
IC50 96±n/a nM
Commentsextracted
Citation Barr, KJMaclean, JKZhang, HBeresis, RTZhang, DAndresen, BMAnthony, NJLapointe, BTSciammetta, N 3-cyclohexenyl and cyclohexyl substituted indole and indazole compounds as RORgammaT inhibitors and uses thereof US Patent US9487490 Publication Date 11/8/2016
 
Isoform 2 of Nuclear receptor ROR-gamma (RORgT)
Name:Isoform 2 of Nuclear receptor ROR-gamma (RORgT)
Type:Protein
Mol. Mass.:55831.73
Organism:Homo sapiens (Human)
Description:P51449-2
Residue:497
BDBM256392
NameBDBM256392
Synonyms:US9487490, 10B
TypeSmall organic molecule
Emp. Form.C24H19ClF4N2O3
Mol. Mass.494.866
SMILESCC1(C)C=C(CC[C@@H]1C(O)=O)c1nn(C(=O)c2c(Cl)cccc2C(F)(F)F)c2cccc(F)c12