Reaction Details
TargetBeta-adrenergic receptor kinase 1
LigandBDBM258594
Substrate/Competitorn/a
Meas. Tech.Competition Binding Assay
Temperature298.15±n/a K
IC50>20±n/a nM
Commentsextracted
Citation Akama, TJarnagin, KZhang, YZhou, YPlattner, JJSullivan, DC Boron-containing small molecules US Patent US9493490 Publication Date 11/15/2016
 
Beta-adrenergic receptor kinase 1
Name:Beta-adrenergic receptor kinase 1
Type:Enzyme
Mol. Mass.:79581.30
Organism:Homo sapiens (Human)
Description:P25098
Residue:689
BDBM258594
NameBDBM258594
Synonyms:US9493490, 6-(4-(1-aminoethyl)-2-fluorophenoxy)benzo[c][1,2]oxaborol-1(3H)-ol US9493490, Example 3
TypeSmall organic molecule
Emp. Form.C15H15BFNO3
Mol. Mass.287.094
SMILESCC(N)c1ccc(Oc2ccc3COB(O)c3c2)c(F)c1