Reaction Details
TargetcAMP-dependent protein kinase catalytic subunit alpha
LigandBDBM258599
Substrate/Competitorn/a
Meas. Tech.Competition Binding Assay
Temperature298.15±n/a K
IC50 7.88±n/a nM
Commentsextracted
Citation Akama, TJarnagin, KZhang, YZhou, YPlattner, JJSullivan, DC Boron-containing small molecules US Patent US9493490 Publication Date 11/15/2016
 
cAMP-dependent protein kinase catalytic subunit alpha
Name:cAMP-dependent protein kinase catalytic subunit alpha
Type:Enzyme Catalytic Subunit
Mol. Mass.:40598.73
Organism:Homo sapiens (Human)
Description:n/a
Residue:351
BDBM258599
NameBDBM258599
Synonyms:US9493490, Example 11 US9493490, tert-butyl 2-fluoro-3-(1-hydroxy-7-methyl-1,3-dihydrobenzo[c][1,2]oxaborol-6-yloxy)benzylcarbamate
TypeSmall organic molecule
Emp. Form.C20H23BFNO5
Mol. Mass.387.21
SMILESCc1c2B(O)OCc2ccc1Oc1cccc(CNC(=O)OC(C)(C)C)c1F