Reaction Details
TargetBeta-adrenergic receptor kinase 1
LigandBDBM258600
Substrate/Competitorn/a
Meas. Tech.Competition Binding Assay
Temperature298.15±n/a K
IC50>30±n/a nM
Commentsextracted
Citation Akama, TJarnagin, KZhang, YZhou, YPlattner, JJSullivan, DC Boron-containing small molecules US Patent US9493490 Publication Date 11/15/2016
 
Beta-adrenergic receptor kinase 1
Name:Beta-adrenergic receptor kinase 1
Type:Enzyme
Mol. Mass.:79581.30
Organism:Homo sapiens (Human)
Description:P25098
Residue:689
BDBM258600
NameBDBM258600
Synonyms:US9493490, 6-(3-(aminomethyl)-2-fluorophenoxy)-7-methylbenzo[c][1,2]oxaborol-1(3H)-ol US9493490, M
TypeSmall organic molecule
Emp. Form.C15H15BFNO3
Mol. Mass.287.094
SMILESCc1c2B(O)OCc2ccc1Oc1cccc(CN)c1F