Reaction Details
TargetBeta-secretase 1
LigandBDBM258911
Substrate/Competitorn/a
Meas. Tech.BACE1 HTRF FRET Assay
pH5±n/a
Temperature303.15±n/a K
Ki 3.6±n/a nM
Commentsextracted
Citation Wu, WBurnett, DAStamford, AWCumming, JNBennett, CEGilbert, EJScott, JDYu, YPeng, X 5-substituted iminothiazines and their mono- and dioxides as BACE inhibitors, compositions, and their use US Patent US9499502 Publication Date 11/22/2016
 
Beta-secretase 1
Name:Beta-secretase 1
Type:Protein
Mol. Mass.:55755.10
Organism:Homo sapiens (Human)
Description:P56817
Residue:501
BDBM258911
NameBDBM258911
Synonyms:US9499502, 9q
TypeSmall organic molecule
Emp. Form.C19H20F3N5O3S
Mol. Mass.455.454
SMILESC[C@]1(CS(=O)(=O)C(C)(C)C(=N)N1)c1cc(NC(=O)c2cnc(cn2)C(F)F)ccc1F