Reaction Details
TargetBeta-secretase 1
LigandBDBM259002
Substrate/Competitorn/a
Meas. Tech.BACE1 HTRF FRET Assay
pH5±n/a
Temperature303.15±n/a K
Ki 4.4±n/a nM
Commentsextracted
Citation Wu, WBurnett, DAStamford, AWCumming, JNBennett, CEGilbert, EJScott, JDYu, YPeng, X 5-substituted iminothiazines and their mono- and dioxides as BACE inhibitors, compositions, and their use US Patent US9499502 Publication Date 11/22/2016
 
Beta-secretase 1
Name:Beta-secretase 1
Type:Protein
Mol. Mass.:55755.10
Organism:Homo sapiens (Human)
Description:P56817
Residue:501
BDBM259002
NameBDBM259002
Synonyms:US9499502, 9cw-a
TypeSmall organic molecule
Emp. Form.C23H21ClFN5O3S
Mol. Mass.501.961
SMILESC[C@]1(CS(=O)(=O)[C@](C)(C(=N)N1)c1ccccn1)c1cc(NC(=O)c2ccc(Cl)cn2)ccc1F