Reaction Details
TargetBeta-secretase 2
LigandBDBM258909
Substrate/Competitorn/a
Meas. Tech.Time-Resolved Endpoint Proteolysis Assay
pH5±n/a
Temperature303.15±n/a K
Ki 16±n/a nM
Commentsextracted
Citation Wu, WBurnett, DAStamford, AWCumming, JNBennett, CEGilbert, EJScott, JDYu, YPeng, X 5-substituted iminothiazines and their mono- and dioxides as BACE inhibitors, compositions, and their use US Patent US9499502 Publication Date 11/22/2016
 
Beta-secretase 2
Name:Beta-secretase 2
Type:Protein
Mol. Mass.:56171.20
Organism:Homo sapiens (Human)
Description:Q9Y5Z0
Residue:518
BDBM258909
NameBDBM258909
Synonyms:US9499502, 9j
TypeSmall organic molecule
Emp. Form.C18H20F3N5O3S
Mol. Mass.443.443
SMILESC[C@]1(CS(=O)(=O)C(C)(C)C(=N)N1)c1cc(NC(=O)c2ccn(n2)C(F)F)ccc1F