Reaction Details
TargetPoly [ADP-ribose] polymerase tankyrase-1 [1091-1325]
LigandBDBM259576
Substrate/Competitorn/a
Meas. Tech.Biochemical Assay
IC50 0.0597±n/a nM
Citation Bregman, HBuchanan, JLChakka, NDimauro, EFGunaydin, HGuzman-Perez, AHua, ZHuang, X Quinazolinone compounds and derivatives thereof US Patent US9505749 Publication Date 11/29/2016
 
Poly [ADP-ribose] polymerase tankyrase-1 [1091-1325]
Name:Poly [ADP-ribose] polymerase tankyrase-1 [1091-1325]
Type:Enzyme
Mol. Mass.:26714.90
Organism:Homo sapiens (Human)
Description:O95271[1091-1325]
Residue:235
BDBM259576
NameBDBM259576
Synonyms:US9505749, 87
TypeSmall organic molecule
Emp. Form.C23H22ClN5O3S
Mol. Mass.483.97
SMILESClc1ccc2n([C@H]3CC[C@@H](CC3)NC(=O)CSc3nc4ccccc4c(=O)[nH]3)c(=O)[nH]c2c1