Reaction Details
TargetPoly [ADP-ribose] polymerase tankyrase-2 [946-1162]
LigandBDBM259523
Substrate/Competitorn/a
Meas. Tech.Biochemical Assay
IC50 0.981±n/a nM
Citation Bregman, HBuchanan, JLChakka, NDimauro, EFGunaydin, HGuzman-Perez, AHua, ZHuang, X Quinazolinone compounds and derivatives thereof US Patent US9505749 Publication Date 11/29/2016
 
Poly [ADP-ribose] polymerase tankyrase-2 [946-1162]
Name:Poly [ADP-ribose] polymerase tankyrase-2 [946-1162]
Type:Enzyme
Mol. Mass.:24581.05
Organism:Homo sapiens (Human)
Description:aa 946-1162
Residue:217
BDBM259523
NameBDBM259523
Synonyms:US9505749, 34
TypeSmall organic molecule
Emp. Form.C25H27N5O4
Mol. Mass.461.513
SMILESCOc1ccc2[nH]c(=O)n(C3CCN(CC3)C(=O)CCCc3nc4ccccc4c(=O)[nH]3)c2c1