Reaction Details
TargetPoly [ADP-ribose] polymerase tankyrase-2 [946-1162]
LigandBDBM259524
Substrate/Competitorn/a
Meas. Tech.Biochemical Assay
IC50 0.196±n/a nM
Citation Bregman, HBuchanan, JLChakka, NDimauro, EFGunaydin, HGuzman-Perez, AHua, ZHuang, X Quinazolinone compounds and derivatives thereof US Patent US9505749 Publication Date 11/29/2016
 
Poly [ADP-ribose] polymerase tankyrase-2 [946-1162]
Name:Poly [ADP-ribose] polymerase tankyrase-2 [946-1162]
Type:Enzyme
Mol. Mass.:24581.05
Organism:Homo sapiens (Human)
Description:aa 946-1162
Residue:217
BDBM259524
NameBDBM259524
Synonyms:US9505749, 35
TypeSmall organic molecule
Emp. Form.C26H25ClFN5O3
Mol. Mass.509.96
SMILESFc1ccc(cc1Cl)-c1nnc(o1)[C@H]1CC[C@@H](CC1)NC(=O)CCCc1nc2ccccc2c(=O)[nH]1