Reaction Details
TargetPoly [ADP-ribose] polymerase tankyrase-2 [946-1162]
LigandBDBM259528
Substrate/Competitorn/a
Meas. Tech.Biochemical Assay
IC50 0.389±n/a nM
Citation Bregman, HBuchanan, JLChakka, NDimauro, EFGunaydin, HGuzman-Perez, AHua, ZHuang, X Quinazolinone compounds and derivatives thereof US Patent US9505749 Publication Date 11/29/2016
 
Poly [ADP-ribose] polymerase tankyrase-2 [946-1162]
Name:Poly [ADP-ribose] polymerase tankyrase-2 [946-1162]
Type:Enzyme
Mol. Mass.:24581.05
Organism:Homo sapiens (Human)
Description:aa 946-1162
Residue:217
BDBM259528
NameBDBM259528
Synonyms:US9505749, 39
TypeSmall organic molecule
Emp. Form.C23H21N5O3S
Mol. Mass.447.51
SMILESO=C(CCSc1nc2ccccc2c(=O)[nH]1)N[C@H]1C[C@H](C1)c1nnc(o1)-c1ccccc1