Reaction Details
TargetPoly [ADP-ribose] polymerase tankyrase-2 [946-1162]
LigandBDBM259540
Substrate/Competitorn/a
Meas. Tech.Biochemical Assay
IC50 0.517±n/a nM
Citation Bregman, HBuchanan, JLChakka, NDimauro, EFGunaydin, HGuzman-Perez, AHua, ZHuang, X Quinazolinone compounds and derivatives thereof US Patent US9505749 Publication Date 11/29/2016
 
Poly [ADP-ribose] polymerase tankyrase-2 [946-1162]
Name:Poly [ADP-ribose] polymerase tankyrase-2 [946-1162]
Type:Enzyme
Mol. Mass.:24581.05
Organism:Homo sapiens (Human)
Description:aa 946-1162
Residue:217
BDBM259540
NameBDBM259540
Synonyms:US9505749, 51
TypeSmall organic molecule
Emp. Form.C24H24FN5O3
Mol. Mass.449.4775
SMILESFc1ccc2n(C3CCN(CC3)C(=O)CCCc3nc4ccccc4c(=O)[nH]3)c(=O)[nH]c2c1