Reaction Details
TargetPoly [ADP-ribose] polymerase tankyrase-2 [946-1162]
LigandBDBM259542
Substrate/Competitorn/a
Meas. Tech.Biochemical Assay
IC50 0.593±n/a nM
Citation Bregman, HBuchanan, JLChakka, NDimauro, EFGunaydin, HGuzman-Perez, AHua, ZHuang, X Quinazolinone compounds and derivatives thereof US Patent US9505749 Publication Date 11/29/2016
 
Poly [ADP-ribose] polymerase tankyrase-2 [946-1162]
Name:Poly [ADP-ribose] polymerase tankyrase-2 [946-1162]
Type:Enzyme
Mol. Mass.:24581.05
Organism:Homo sapiens (Human)
Description:aa 946-1162
Residue:217
BDBM259542
NameBDBM259542
Synonyms:US9505749, 53
TypeSmall organic molecule
Emp. Form.C24H23FN4O4
Mol. Mass.450.4622
SMILESFc1ccc2n(C3CCN(CC3)C(=O)CCCc3nc4ccccc4c(=O)[nH]3)c(=O)oc2c1