Reaction Details
TargetPoly [ADP-ribose] polymerase tankyrase-2 [946-1162]
LigandBDBM259584
Substrate/Competitorn/a
Meas. Tech.Biochemical Assay
IC50 0.16±n/a nM
Citation Bregman, HBuchanan, JLChakka, NDimauro, EFGunaydin, HGuzman-Perez, AHua, ZHuang, X Quinazolinone compounds and derivatives thereof US Patent US9505749 Publication Date 11/29/2016
 
Poly [ADP-ribose] polymerase tankyrase-2 [946-1162]
Name:Poly [ADP-ribose] polymerase tankyrase-2 [946-1162]
Type:Enzyme
Mol. Mass.:24581.05
Organism:Homo sapiens (Human)
Description:aa 946-1162
Residue:217
BDBM259584
NameBDBM259584
Synonyms:US9505749, 95
TypeSmall organic molecule
Emp. Form.C27H28N4O3
Mol. Mass.456.5362
SMILESO=C(CCCc1nc2ccccc2c(=O)[nH]1)N[C@H]1CC[C@@H](CC1)c1ncc(o1)-c1ccccc1