Reaction Details
TargetPoly [ADP-ribose] polymerase tankyrase-2 [946-1162]
LigandBDBM259588
Substrate/Competitorn/a
Meas. Tech.Biochemical Assay
IC50 0.362±n/a nM
Citation Bregman, HBuchanan, JLChakka, NDimauro, EFGunaydin, HGuzman-Perez, AHua, ZHuang, X Quinazolinone compounds and derivatives thereof US Patent US9505749 Publication Date 11/29/2016
 
Poly [ADP-ribose] polymerase tankyrase-2 [946-1162]
Name:Poly [ADP-ribose] polymerase tankyrase-2 [946-1162]
Type:Enzyme
Mol. Mass.:24581.05
Organism:Homo sapiens (Human)
Description:aa 946-1162
Residue:217
BDBM259588
NameBDBM259588
Synonyms:US9505749, 100
TypeSmall organic molecule
Emp. Form.C23H24FN3O3S
Mol. Mass.441.518
SMILESFc1ccc(O[C@H]2CC[C@@H](CC2)NC(=O)CCSc2nc3ccccc3c(=O)[nH]2)cc1