Reaction Details
TargetRibosomal protein S6 kinase alpha-3 [399-740]
LigandBDBM259836
Substrate/Competitorn/a
Meas. Tech.RSK2 Inhibition Assay
pH8±n/a
Temperature295.15±n/a K
IC50 14±n/a nM
Commentsextracted
Citation Taunton, Jr., JWMaglathlin, RSerafimova, ICohen, MSMiller, RPaavilainen, VMcFarland, JKrishnan, S Kinase inhibitors US Patent US9505766 Publication Date 11/29/2016
 
Ribosomal protein S6 kinase alpha-3 [399-740]
Name:Ribosomal protein S6 kinase alpha-3 [399-740]
Type:Enzyme
Mol. Mass.:38435.14
Organism:Homo sapiens (Human)
Description:aa 399-740; RSK2 C-terminal kinase domain (CTD)
Residue:342
BDBM259836
NameBDBM259836
Synonyms:US9505766, 40
TypeSmall organic molecule
Emp. Form.C20H18N4O4
Mol. Mass.378.3813
SMILESCOc1cc(cc(OC)c1OC)-c1n[nH]c2ccc(\C=C(/C#N)C(N)=O)cc12