Reaction Details
TargetRibosomal protein S6 kinase alpha-3 [399-740]
LigandBDBM259845
Substrate/Competitorn/a
Meas. Tech.RSK2 Inhibition Assay
pH8±n/a
Temperature295.15±n/a K
IC50 6.5±n/a nM
Commentsextracted
Citation Taunton, Jr., JWMaglathlin, RSerafimova, ICohen, MSMiller, RPaavilainen, VMcFarland, JKrishnan, S Kinase inhibitors US Patent US9505766 Publication Date 11/29/2016
 
Ribosomal protein S6 kinase alpha-3 [399-740]
Name:Ribosomal protein S6 kinase alpha-3 [399-740]
Type:Enzyme
Mol. Mass.:38435.14
Organism:Homo sapiens (Human)
Description:aa 399-740; RSK2 C-terminal kinase domain (CTD)
Residue:342
BDBM259845
NameBDBM259845
Synonyms:US9505766, 49
TypeSmall organic molecule
Emp. Form.C22H24N6O2
Mol. Mass.404.465
SMILESCN(C)C(=O)C(=C\c1c(-c2ccc(C)cc2)c2c(N)ncnc2n1CCCO)\C#N