Reaction Details
TargetMitotic checkpoint serine/threonine-protein kinase BUB1
LigandBDBM414909
Substrate/Competitorn/a
Meas. Tech.Kinase Assay
IC50 4.04±n/a nM
Citation Graham, KKlar, UBriem, HHitchcock, MBärfacker, LEis, KSchulze, VSiemeister, GBone, WSchröder, JHolton, SLienau, PTempel, RSonnenschein, HBálint, JGraubaum, H 3-amino-1,5,6,7-tetrahydro-4H-indol-4-ones US Patent US10428044 Publication Date 10/1/2019
 
Mitotic checkpoint serine/threonine-protein kinase BUB1
Name:Mitotic checkpoint serine/threonine-protein kinase BUB1
Type:PROTEIN
Mol. Mass.:122372.31
Organism:Homo sapiens (Human)
Description:ChEMBL_1510603
Residue:1085
BDBM414909
NameBDBM414909
Synonyms:Preparation of 3-(phenylamino)-6-(propan-2-yl)-2-(pyridin-4-yl)-1,5,6,7-tetrahydro-4H-indol-4-one US10428044, Example 18 | US10428044, Example 7
TypeSmall organic molecule
Emp. Form.C22H23N3O
Mol. Mass.345.4375
SMILESCC(C)C1Cc2[nH]c(c(Nc3ccccc3)c2C(=O)C1)-c1ccncc1