Reaction Details
TargetMitotic checkpoint serine/threonine-protein kinase BUB1
LigandBDBM415284
Substrate/Competitorn/a
Meas. Tech.Kinase Assay
IC50 4.52±n/a nM
Citation Graham, KKlar, UBriem, HHitchcock, MBärfacker, LEis, KSchulze, VSiemeister, GBone, WSchröder, JHolton, SLienau, PTempel, RSonnenschein, HBálint, JGraubaum, H 3-amino-1,5,6,7-tetrahydro-4H-indol-4-ones US Patent US10428044 Publication Date 10/1/2019
 
Mitotic checkpoint serine/threonine-protein kinase BUB1
Name:Mitotic checkpoint serine/threonine-protein kinase BUB1
Type:PROTEIN
Mol. Mass.:122372.31
Organism:Homo sapiens (Human)
Description:ChEMBL_1510603
Residue:1085
BDBM415284
NameBDBM415284
Synonyms:Preparation of 1-{4-[6,6-dimethyl-4-oxo-3-(phenylamino)-4,5,6,7-tetrahydro-1H-indol-2-yl]pyridin-2-yl}-3-(1-methyl-1H-pyrazol-4-yl)urea | US10428044, Example 391
TypeSmall organic molecule
Emp. Form.C26H27N7O2
Mol. Mass.469.5383
SMILESCn1cc(NC(=O)Nc2cc(ccn2)-c2[nH]c3CC(C)(C)CC(=O)c3c2Nc2ccccc2)cn1