Reaction Details
TargetMitotic checkpoint serine/threonine-protein kinase BUB1
LigandBDBM415336
Substrate/Competitorn/a
Meas. Tech.Kinase Assay
IC50 4.38±n/a nM
Citation Graham, KKlar, UBriem, HHitchcock, MBärfacker, LEis, KSchulze, VSiemeister, GBone, WSchröder, JHolton, SLienau, PTempel, RSonnenschein, HBálint, JGraubaum, H 3-amino-1,5,6,7-tetrahydro-4H-indol-4-ones US Patent US10428044 Publication Date 10/1/2019
 
Mitotic checkpoint serine/threonine-protein kinase BUB1
Name:Mitotic checkpoint serine/threonine-protein kinase BUB1
Type:PROTEIN
Mol. Mass.:122372.31
Organism:Homo sapiens (Human)
Description:ChEMBL_1510603
Residue:1085
BDBM415336
NameBDBM415336
Synonyms:Preparation of 1-benzyl-N-{4-[4-oxo-3-(phenylamino)-4,5,6,7-tetrahydro-1H-indol-2-yl]pyridin-2-yl}-1H-pyrazole-4-carboxamide | US10428044, Example 449
TypeSmall organic molecule
Emp. Form.C30H26N6O2
Mol. Mass.502.5664
SMILESO=C(Nc1cc(ccn1)-c1[nH]c2CCCC(=O)c2c1Nc1ccccc1)c1cnn(Cc2ccccc2)c1