Reaction Details
TargetMitotic checkpoint serine/threonine-protein kinase BUB1
LigandBDBM415365
Substrate/Competitorn/a
Meas. Tech.Kinase Assay
IC50 4.23±n/a nM
Citation Graham, KKlar, UBriem, HHitchcock, MBärfacker, LEis, KSchulze, VSiemeister, GBone, WSchröder, JHolton, SLienau, PTempel, RSonnenschein, HBálint, JGraubaum, H 3-amino-1,5,6,7-tetrahydro-4H-indol-4-ones US Patent US10428044 Publication Date 10/1/2019
 
Mitotic checkpoint serine/threonine-protein kinase BUB1
Name:Mitotic checkpoint serine/threonine-protein kinase BUB1
Type:PROTEIN
Mol. Mass.:122372.31
Organism:Homo sapiens (Human)
Description:ChEMBL_1510603
Residue:1085
BDBM415365
NameBDBM415365
Synonyms:Preparation of 1-benzyl-N-{4-[6,6-dimethyl-4-oxo-3-(phenylamino)-4,5,6,7-tetrahydro-1H-indol-2-yl]pyridin-2-yl}-1H-pyrazole-4-carboxamide | US10428044, Example 478
TypeSmall organic molecule
Emp. Form.C32H30N6O2
Mol. Mass.530.6196
SMILESCC1(C)Cc2[nH]c(c(Nc3ccccc3)c2C(=O)C1)-c1ccnc(NC(=O)c2cnn(Cc3ccccc3)c2)c1