Reaction Details
TargetP2X purinoceptor 7
LigandBDBM254305
Substrate/Competitorn/a
Meas. Tech.Radioligand Binding
Ki 2.50±n/a nM
Citation Alcazar Vaca, MJAllison, BDAndres Gil, JIChrovian, CCCoate, HRDe Angelis, MDeng, XDvorak, CAGelin, CFLetavic, MALiang, JTMani, NSRech, JCSavall, BMSoyode-Johnson, AStenne, BMSwanson, DMWall, JL P2X7 modulators and methods of use US Patent US10112937 Publication Date 10/30/2018
 
P2X purinoceptor 7
Name:P2X purinoceptor 7
Type:Protein
Mol. Mass.:68403.50
Organism:Rattus norvegicus (Rat)
Description:Q64663
Residue:595
BDBM254305
NameBDBM254305
Synonyms:US10112937, Example 202 US10703749, Example 202 | US9464084, 202
TypeSmall organic molecule
Emp. Form.C18H13ClF4N6O
Mol. Mass.440.782
SMILESC[C@H]1Cc2c(CN1C(=O)c1cccc(c1Cl)C(F)(F)F)nnn2-c1ncc(F)cn1