Reaction Details
TargetP2X purinoceptor 7
LigandBDBM254374
Substrate/Competitorn/a
Meas. Tech.Radioligand Binding
Ki 2.30±n/a nM
Citation Alcazar Vaca, MJAllison, BDAndres Gil, JIChrovian, CCCoate, HRDe Angelis, MDeng, XDvorak, CAGelin, CFLetavic, MALiang, JTMani, NSRech, JCSavall, BMSoyode-Johnson, AStenne, BMSwanson, DMWall, JL P2X7 modulators and methods of use US Patent US10112937 Publication Date 10/30/2018
 
P2X purinoceptor 7
Name:P2X purinoceptor 7
Type:Protein
Mol. Mass.:68602.85
Organism:Homo sapiens (Human)
Description:Q99572
Residue:595
BDBM254374
NameBDBM254374
Synonyms:US10112937, Example 281 US9464084, 281
TypeSmall organic molecule
Emp. Form.C18H15F3N6O
Mol. Mass.388.3465
SMILESCc1c(cccc1C(F)(F)F)C(=O)N1CCc2c(C1)nnn2-c1ncccn1