Reaction Details
TargetP2X purinoceptor 7
LigandBDBM254344
Substrate/Competitorn/a
Meas. Tech.Radioligand Binding
Ki 2.20±n/a nM
Citation Alcazar Vaca, MJAllison, BDAndres Gil, JIChrovian, CCCoate, HRDe Angelis, MDeng, XDvorak, CAGelin, CFLetavic, MALiang, JTMani, NSRech, JCSavall, BMSoyode-Johnson, AStenne, BMSwanson, DMWall, JL P2X7 modulators and methods of use US Patent US10112937 Publication Date 10/30/2018
 
P2X purinoceptor 7
Name:P2X purinoceptor 7
Type:Protein
Mol. Mass.:68403.50
Organism:Rattus norvegicus (Rat)
Description:Q64663
Residue:595
BDBM254344
NameBDBM254344
Synonyms:US10112937, Example 249 US10703749, Example 249 | US9464084, 249
TypeSmall organic molecule
Emp. Form.C20H20ClF3N6O2
Mol. Mass.468.86
SMILESCOCCn1ccc(n1)-n1nnc2[C@H](C)N(CCc12)C(=O)c1cccc(c1Cl)C(F)(F)F