Reaction Details
TargetAldehyde dehydrogenase, mitochondrial
LigandBDBM153696
Substrate/Competitorn/a
Meas. Tech.ALDH2 Assay
IC50 25.0±n/a nM
Citation Cannizzaro, CEGraupe, MGuerrero, JALu, YStrickley, RGVenkataramani, CZablocki, J Compounds for the treatment of addiction US Patent US10507215 Publication Date 12/17/2019
 
Aldehyde dehydrogenase, mitochondrial
Name:Aldehyde dehydrogenase, mitochondrial
Type:Enzyme
Mol. Mass.:56382.67
Organism:Homo sapiens (Human)
Description:P05091
Residue:517
BDBM153696
NameBDBM153696
Synonyms:US10507215, Compound 13 US9610299, Example 13
TypeSmall organic molecule
Emp. Form.C19H13Cl2FN2O2
Mol. Mass.391.223
SMILESFc1c[nH]c(=O)cc1-c1ccc(CNC(=O)c2c(Cl)cccc2Cl)cc1