Reaction Details
TargetHistone-lysine N-methyltransferase, H3 lysine-79 specific
LigandBDBM297390
Substrate/Competitorn/a
Meas. Tech.Assays of Enzymatic Activity
IC50 0.730±n/a nM
Citation Olhava, EJChesworth, RPollock, RMJin, L Inhibitors of protein methyltransferase DOT1L and methods of use thereof US Patent US10112968 Publication Date 10/30/2018
 
Histone-lysine N-methyltransferase, H3 lysine-79 specific
Name:Histone-lysine N-methyltransferase, H3 lysine-79 specific
Type:Protein
Mol. Mass.:184911.91
Organism:Homo sapiens (Human)
Description:Q8TEK3
Residue:1537
BDBM297390
NameBDBM297390
Synonyms:(2R,3R,4S,5R)-2-(6-amino-9H-purin-9-yl)-5-((((1s,3R)-3-(2-(5-(tert-butyl)-1H-benzo[d]imidazol-2-yl)ethyl)cyclobutyl)(isopropyl)amino)methyl)tetrahydrofuran-3,4-diol | US10112968, Compound A3
TypeSmall organic molecule
Emp. Form.C30H42N8O3
Mol. Mass.562.7063
SMILESCC(C)N(CC1OC([C@H](O)C1O)n1cnc2c(N)ncnc12)C1CC(CCc2nc3ccc(cc3[nH]2)C(C)(C)C)C1