Reaction Details
TargetHistone-lysine N-methyltransferase, H3 lysine-79 specific
LigandBDBM297394
Substrate/Competitorn/a
Meas. Tech.Assays of Enzymatic Activity
Ki 13.0±7 nM
Kd 1.7±0.2 nM
KOFF 0.02 s-1
KON 12000000 M-1s-1
Citation Olhava, EJChesworth, RPollock, RMJin, L Inhibitors of protein methyltransferase DOT1L and methods of use thereof US Patent US10112968 Publication Date 10/30/2018
 
Histone-lysine N-methyltransferase, H3 lysine-79 specific
Name:Histone-lysine N-methyltransferase, H3 lysine-79 specific
Type:Protein
Mol. Mass.:184911.91
Organism:Homo sapiens (Human)
Description:Q8TEK3
Residue:1537
BDBM297394
NameBDBM297394
Synonyms:US10112968, Compound C118
TypeSmall organic molecule
Emp. Form.C25H36N8O4
Mol. Mass.512.6045
SMILESCN(CCCNC(=O)Nc1ccc(cc1)C(C)(C)C)C[C@H]1OC([C@H](O)[C@@H]1O)n1cnc2c(N)ncnc12