Reaction Details
TargetHistone-lysine N-methyltransferase SMYD3
LigandBDBM432822
Substrate/Competitorn/a
Meas. Tech.SMYD3 Biochemical Assay
IC50 0.800±n/a nM
Citation Mitchell, LHBell, ASChesworth, RFoley, MAKuntz, KWMills, JEMunchhof, MJ Substituted piperidine compounds US Patent US10577363 Publication Date 3/3/2020
 
Histone-lysine N-methyltransferase SMYD3
Name:Histone-lysine N-methyltransferase SMYD3
Type:Enzyme
Mol. Mass.:49101.22
Organism:Homo sapiens (Human)
Description:Q9H7B4-2
Residue:428
BDBM432822
NameBDBM432822
Synonyms:N-((1R,3r,5S)-8-((4- aminocyclohexyl)sulfonyl)-8- azabicyclo[3.2.1]octan-3-yl)-5- cyclopropylisoxazole-3-carboxamide | US10577363, Compound 525
TypeSmall organic molecule
Emp. Form.C20H30N4O4S
Mol. Mass.422.542
SMILESNC1CCC(CC1)S(=O)(=O)N1[C@H]2CC[C@@H]1C[C@@H](C2)NC(=O)c1cc(on1)C1CC1