Reaction Details
TargetHistone-lysine N-methyltransferase SMYD3
LigandBDBM432825
Substrate/Competitorn/a
Meas. Tech.SMYD3 Biochemical Assay
IC50 0.600±n/a nM
Citation Mitchell, LHBell, ASChesworth, RFoley, MAKuntz, KWMills, JEMunchhof, MJ Substituted piperidine compounds US Patent US10577363 Publication Date 3/3/2020
 
Histone-lysine N-methyltransferase SMYD3
Name:Histone-lysine N-methyltransferase SMYD3
Type:Enzyme
Mol. Mass.:49101.22
Organism:Homo sapiens (Human)
Description:Q9H7B4-2
Residue:428
BDBM432825
NameBDBM432825
Synonyms:5-cyclopropyl-N-((1R,3r,5S)-8-(((1-(4,4,4- trifluorobutyl)piperidin-4- yl)methyl)sulfonyl)-8- azabicyclo[3.2.1]octan-3-yl)isoxazole-3- carboxamide | US10577363, Compound 528
TypeSmall organic molecule
Emp. Form.C24H35F3N4O4S
Mol. Mass.532.619
SMILESFC(F)(F)CCCN1CCC(CS(=O)(=O)N2[C@H]3CC[C@@H]2C[C@@H](C3)NC(=O)c2cc(on2)C2CC2)CC1