Reaction Details
TargetHistone-lysine N-methyltransferase SMYD3
LigandBDBM432826
Substrate/Competitorn/a
Meas. Tech.SMYD3 Biochemical Assay
IC50 0.800±n/a nM
Citation Mitchell, LHBell, ASChesworth, RFoley, MAKuntz, KWMills, JEMunchhof, MJ Substituted piperidine compounds US Patent US10577363 Publication Date 3/3/2020
 
Histone-lysine N-methyltransferase SMYD3
Name:Histone-lysine N-methyltransferase SMYD3
Type:Enzyme
Mol. Mass.:49101.22
Organism:Homo sapiens (Human)
Description:Q9H7B4-2
Residue:428
BDBM432826
NameBDBM432826
Synonyms:N-((2S,4S)-1-((4-aminopiperidin-1- yl)sulfonyl)-2-methylpiperidin-4-yl)-5- cyclopropylisoxazole-3-carboxamide | US10577363, Compound 529
TypeSmall organic molecule
Emp. Form.C18H29N5O4S
Mol. Mass.411.519
SMILESC[C@H]1C[C@H](CCN1S(=O)(=O)N1CCC(N)CC1)NC(=O)c1cc(on1)C1CC1