Reaction Details
TargetHistone-lysine N-methyltransferase SMYD3
LigandBDBM432827
Substrate/Competitorn/a
Meas. Tech.SMYD3 Biochemical Assay
IC50 0.900±n/a nM
Citation Mitchell, LHBell, ASChesworth, RFoley, MAKuntz, KWMills, JEMunchhof, MJ Substituted piperidine compounds US Patent US10577363 Publication Date 3/3/2020
 
Histone-lysine N-methyltransferase SMYD3
Name:Histone-lysine N-methyltransferase SMYD3
Type:Enzyme
Mol. Mass.:49101.22
Organism:Homo sapiens (Human)
Description:Q9H7B4-2
Residue:428
BDBM432827
NameBDBM432827
Synonyms:5-cyclopropyl-N-((2S,4S)-2-methyl-1- (((1-phenethylpiperidin-4- yl)methyl)sulfonyl)piperidin-4- yl)isoxazole-3-carboxamide | US10577363, Compound 530
TypeSmall organic molecule
Emp. Form.C27H38N4O4S
Mol. Mass.514.68
SMILESC[C@H]1C[C@H](CCN1S(=O)(=O)CC1CCN(CCc2ccccc2)CC1)NC(=O)c1cc(on1)C1CC1