Reaction Details
TargetHistone-lysine N-methyltransferase SMYD3
LigandBDBM432829
Substrate/Competitorn/a
Meas. Tech.SMYD3 Biochemical Assay
IC50 0.900±n/a nM
Citation Mitchell, LHBell, ASChesworth, RFoley, MAKuntz, KWMills, JEMunchhof, MJ Substituted piperidine compounds US Patent US10577363 Publication Date 3/3/2020
 
Histone-lysine N-methyltransferase SMYD3
Name:Histone-lysine N-methyltransferase SMYD3
Type:Enzyme
Mol. Mass.:49101.22
Organism:Homo sapiens (Human)
Description:Q9H7B4-2
Residue:428
BDBM432829
NameBDBM432829
Synonyms:N-((1R,3r,5S)-8-((4-aminopiperidin-1- yl)sulfonyl)-8-azabicyclo[3.2.1]octan-3- yl)-5-cyclopropylisoxazole-3-carboxamide | US10577363, Compound 532
TypeSmall organic molecule
Emp. Form.C19H29N5O4S
Mol. Mass.423.53
SMILESNC1CCN(CC1)S(=O)(=O)N1[C@H]2CC[C@@H]1C[C@@H](C2)NC(=O)c1cc(on1)C1CC1