Reaction Details
TargetHistone-lysine N-methyltransferase SMYD3
LigandBDBM433067
Substrate/Competitorn/a
Meas. Tech.SMYD3 Biochemical Assay
IC50 0.940±n/a nM
Citation Mitchell, LHBell, ASChesworth, RFoley, MAKuntz, KWMills, JEMunchhof, MJ Substituted piperidine compounds US Patent US10577363 Publication Date 3/3/2020
 
Histone-lysine N-methyltransferase SMYD3
Name:Histone-lysine N-methyltransferase SMYD3
Type:Enzyme
Mol. Mass.:49101.22
Organism:Homo sapiens (Human)
Description:Q9H7B4-2
Residue:428
BDBM433067
NameBDBM433067
Synonyms:5-cyclopropyl-N-((1R,3R,5S)-8-(((1s,4S)- 4-(dimethylamino)cyclohexyl)sulfonyl)-8- azabicyclo[3.2.1]octan-3-yl)isoxazole-3- carboxamide | US10577363, Compound 771
TypeSmall organic molecule
Emp. Form.C22H34N4O4S
Mol. Mass.450.595
SMILESCN(C)[C@H]1CC[C@H](CC1)S(=O)(=O)N1[C@H]2CC[C@@H]1C[C@@H](C2)NC(=O)c1cc(on1)C1CC1