Reaction Details
TargetHistone-lysine N-methyltransferase SMYD3
LigandBDBM433068
Substrate/Competitorn/a
Meas. Tech.SMYD3 Biochemical Assay
IC50 0.950±n/a nM
Citation Mitchell, LHBell, ASChesworth, RFoley, MAKuntz, KWMills, JEMunchhof, MJ Substituted piperidine compounds US Patent US10577363 Publication Date 3/3/2020
 
Histone-lysine N-methyltransferase SMYD3
Name:Histone-lysine N-methyltransferase SMYD3
Type:Enzyme
Mol. Mass.:49101.22
Organism:Homo sapiens (Human)
Description:Q9H7B4-2
Residue:428
BDBM433068
NameBDBM433068
Synonyms:N-((2S,4S)-1-((((1S,3S)-3- aminocyclopentyl)methyl)sulfonyl)-2- methylpiperidin-4-yl)-5- cyclopropylisoxazole-3-carboxamide | US10577363, Compound 772
TypeSmall organic molecule
Emp. Form.C19H30N4O4S
Mol. Mass.410.531
SMILESC[C@H]1C[C@H](CCN1S(=O)(=O)C[C@H]1CC[C@H](N)C1)NC(=O)c1cc(on1)C1CC1