Reaction Details
TargetTyrosine-protein kinase BTK
LigandBDBM164805
Substrate/Competitorn/a
Meas. Tech.Enzyme Assay
IC50 0.080±n/a nM
Citation Liu, QWatterson, SHMacor, JENgu, KAhmad, S Indole carboxamide compounds US Patent US10604504 Publication Date 3/31/2020
 
Tyrosine-protein kinase BTK
Name:Tyrosine-protein kinase BTK
Type:Enzyme
Mol. Mass.:76289.95
Organism:Homo sapiens (Human)
Description:Q06187
Residue:659
BDBM164805
NameBDBM164805
Synonyms:US10604504, Example 4 US9688629, 4 US9920031, Example 4
TypeSmall organic molecule
Emp. Form.C19H19N3O3S
Mol. Mass.369.437
SMILESCc1[nH]c2c(ccc(-c3cccc(NS(=O)(=O)C=C)c3)c2c1C)C(N)=O