Reaction Details
TargetReplicase polyprotein 1ab
LigandBDBM419133
Substrate/Competitorn/a
Meas. Tech.fluorescent peptide assay
Ki 30±3.90 nM
IC50 31±4.00 nM
Citation Yang, KSMa, XRMa, YAlugubelli, YRScott, DAVatansever, ECDrelich, AKSankaran, BGeng, ZZBlankenship, LRWard, HESheng, YJHsu, JCKratch, KCZhao, BHayatshahi, HSLiu, JLi, PFierke, CATseng, CKXu, SLiu, WR A Quick Route to Multiple Highly Potent SARS-CoV-2 Main Protease Inhibitors ChemMedChem0:0 (2020) 
 
Replicase polyprotein 1ab
Name:Replicase polyprotein 1ab
Type:Protein
Mol. Mass.:794070.71
Organism:2019-nCoV
Description:P0DTD1
Residue:7096
BDBM419133
NameBDBM419133
Synonyms:BDBM429386 | GC376
TypeSmall organic molecule
Emp. Form.C21H30N3O8S
Mol. Mass.484.544
SMILESCC(C)C[C@H](NC(=O)OCc1ccccc1)C(=O)N[C@@H](C[C@@H]1CCNC1=O)C(O)S([O-])(=O)=O