Reaction Details
TargetReplicase polyprotein 1ab
LigandBDBM442746
Substrate/Competitorn/a
Meas. Tech.fluorescent peptide assay
Ki 98±23 nM
IC50 100±23 nM
Citation Yang, KSMa, XRMa, YAlugubelli, YRScott, DAVatansever, ECDrelich, AKSankaran, BGeng, ZZBlankenship, LRWard, HESheng, YJHsu, JCKratch, KCZhao, BHayatshahi, HSLiu, JLi, PFierke, CATseng, CKXu, SLiu, WR A Quick Route to Multiple Highly Potent SARS-CoV-2 Main Protease Inhibitors ChemMedChem0:0 (2020) 
 
Replicase polyprotein 1ab
Name:Replicase polyprotein 1ab
Type:Protein
Mol. Mass.:794070.71
Organism:2019-nCoV
Description:P0DTD1
Residue:7096
BDBM442746
NameBDBM442746
Synonyms:MPI1
TypeSmall organic molecule
Emp. Form.C24H27N3O5
Mol. Mass.437.4883
SMILESO=C[C@H](C[C@@H]1CCNC1=O)NC(=O)[C@H](Cc1ccccc1)NC(=O)OCc1ccccc1