Reaction Details
TargetReplicase polyprotein 1ab
LigandBDBM429372
Substrate/Competitorn/a
Meas. Tech.fluorescent peptide assay
Ki 101±14 nM
IC50 103±14 nM
Citation Yang, KSMa, XRMa, YAlugubelli, YRScott, DAVatansever, ECDrelich, AKSankaran, BGeng, ZZBlankenship, LRWard, HESheng, YJHsu, JCKratch, KCZhao, BHayatshahi, HSLiu, JLi, PFierke, CATseng, CKXu, SLiu, WR A Quick Route to Multiple Highly Potent SARS-CoV-2 Main Protease Inhibitors ChemMedChem0:0 (2020) 
 
Replicase polyprotein 1ab
Name:Replicase polyprotein 1ab
Type:Protein
Mol. Mass.:794070.71
Organism:2019-nCoV
Description:P0DTD1
Residue:7096
BDBM429372
NameBDBM429372
Synonyms:MPI2 | med.21724, Compound 43
TypeSmall Organic Molecule
Emp. Form.C25H25ClFN3O4
Mol. Mass.485.935
SMILESFc1cc(Cl)ccc1\C=C\C(=O)N[C@@H](Cc1ccccc1)C(=O)N[C@@H](C[C@@H]1CCNC1=O)C=O