Reaction Details
TargetReplicase polyprotein 1ab
LigandBDBM423466
Substrate/Competitorn/a
Meas. Tech.fluorescent peptide assay
Ki 8.30±1.50 nM
IC50 8.50±1.50 nM
Citation Yang, KSMa, XRMa, YAlugubelli, YRScott, DAVatansever, ECDrelich, AKSankaran, BGeng, ZZBlankenship, LRWard, HESheng, YJHsu, JCKratch, KCZhao, BHayatshahi, HSLiu, JLi, PFierke, CATseng, CKXu, SLiu, WR A Quick Route to Multiple Highly Potent SARS-CoV-2 Main Protease Inhibitors ChemMedChem0:0 (2020) 
 
Replicase polyprotein 1ab
Name:Replicase polyprotein 1ab
Type:Protein
Mol. Mass.:794070.71
Organism:2019-nCoV
Description:P0DTD1
Residue:7096
BDBM423466
NameBDBM423466
Synonyms:WO2006061714, P39.1 cmdc.202100576, 10d
TypeSmall Organic Molecule
Emp. Form.C26H38N4O6
Mol. Mass.502.6031
SMILESCC(C)C[C@H](NC(=O)[C@@H](NC(=O)OCc1ccccc1)C(C)C)C(=O)N[C@@H](C[C@@H]1CCNC1=O)C=O